09/01/2015 Flame KK v18D-1 319 MB Gaia-ui Automation mozilla-central Mozilla RIL Full Flash Build 33/43 smoketests, 112/129 non-smoketests

Verson() xiongfuchao at mgsei.com
Tue Sep 1 10:23:09 UTC 2015


Smoketests:
Test failures - 0 replicable manually:

 

       * [Not reproduced manually] test_add_new_contact.py - Can’t
reproduced it by Manually(0/5).

* [Not reproduced manually] test_sms_contact.py - Can’t reproduced it by
Manually(0/5).

       * [Not reproduced manually] test_setup_basic_gmail.py - Can’t
reproduced it by Manually(0/5).

* [Not reproduced manually] test_homescreen_delete_app.py - Can’t
reproduced it by Manually(0/5).

* [Not reproduced manually] test_homescreen_delete_app_packaged.py - Can’t
reproduced it by Manually(0/5).

* [Not reproduced manually] test_homescreen_launch_app.py - Can’t
reproduced it by Manually(0/5).

* [Not reproduced manually] test_homescreen_launch_app_packaged.py - Can’t
reproduced it by Manually(0/5).
    

Non-smoketests:
Test failures - 0 replicable manually:

       

* [Not reproduced manually] test_browser_save_image.py - Can’t reproduced
it by Manually(0/5).

* [Not reproduced manually] test_browser_navigation.py - Can’t reproduced
it by Manually(0/5).

* [Not reproduced manually] test_browser_clear_browsing_history.py - Can’t
reproduced it by Manually(0/5).

* [Not reproduced manually] test_browser_private_navigation.py
-ElementNotVisibleException: ElementNotVisibleException: Element is not
currently visible and may not be manipulated - Can’t reproduced it by
Manually(0/5).

* [Not reproduced manually] test_login_bzlite.py - Device does not have the
“Bugzilla Lite” app.

* [Not reproduced manually] test_import_contacts_from_gmail.py -
<https://bugzil.la/1155763> https://bugzil.la/1155763 -xfail.

* [Not reproduced manually] test_dialer_add_contact.py - Bug
<https://bugzilla.mozilla.org/show_bug.cgi?id=1199597>  1199597 -
[v2.5][Gaia::UI Tests]test_edit_contact.py:"NoSuchElementException:
NoSuchElementException: Unable to locate element: details-view-header"

* [Not reproduced manually]
test_dialer_miss_call_from_known_contact_notification.py - Bug
<https://bugzilla.mozilla.org/show_bug.cgi?id=1140278>  1140278 -
test_dialer_miss_call_from_known_contact_notification.py failed because
caller number is withheld.

* [Not reproduced manually] test_dialer_clear_miss_call_notification.py -
Bug <https://bugzilla.mozilla.org/show_bug.cgi?id=1140278>  1140278 -
test_dialer_miss_call_from_known_contact_notification.py failed because
caller number is withheld.

* [Not reproduced manually] test_dialer_receive_call_with_contact_photo.py -
We don't have the plivo account.

* [Not reproduced manually] test_spark_apps_present.py - Bug
<https://bugzilla.mozilla.org/show_bug.cgi?id=1190513>  1190513 -
test_spark_apps_present.py: Spark not available on flame builds flashed for
automation.

       

Expected failures / disabled tests:

       

   * [Expected fail] test_change_language_settings_rtl.py -
https://bugzil.la/1137766 - Error in both test_settings_change_language
tests: exception "Element '%s' could not be foundin select wrapper".

   * [Expected fail] test_change_language_settings.py -
https://bugzil.la/1137766 - Error in both test_settings_change_language
tests: exception "Element '%s' could not be foundin select wrapper".

   * [Expected fail] test_import_gmail_no_network.py -
https://bugzil.la/1155763 -xfail.

   * [Expected fail] test_call_log_groups.TestCallLogGroups.py -
https://bugzil.la/1117804 - [v2.2] Investigate test_call_log_groups failure.

   * [Disabled] test_settings_change_time_format.py -- Bug 1144868 - Disable
test_settings_change_time_format consistently failing because of Bug
1144686.

   * [Disabled] test_settings_airplane_mode.py - https://bugzil.la/1131070.

   * [Disabled] test_settings_bluetooth.py - https://bugzil.la/1134244 -
test_settings_bluetooth.py:test_toggle_bluetooth_settings is failing on
bluetooth_settings.enable_visible_to_all().

   * [Disabled] test_lockscreen_time_check.py - Bug 1167848 - Disable
test_lockscreen_time_check.py until bug 1141258 is fixed.

   * [Disabled] test_ftu_skip_tour_desktopb2g.py - Bug 1147611 -
Intermittent failures.

   * [Disabled] test_fmradio_find_stations.py - https://bugzil.la/1000863 -
Investigate test_fmradio_find_stations.py failure.

   * [Disabled] test_receive_active_sync_email.py -
https://bugzil.la/1028192 - Problems with ActiveSync accounts.

   * [Disabled] test_setup_and_send_active_sync_email.py - Bug 1028192 -
Problems with ActiveSync accounts.

   * [Disabled] test_dialer_set_up_conference_call.py -
https://bugzil.la/1117813 - Make PlivoUtil use a valid 'answer_url' with a
valid Plivo XM.

   * [Disabled] test_call_log_all_calls.py - https://bugzil.la/1096385 -
Investigate failure in test_call_log_all_calls.py, call log is displayed
erroneously. 

       

Build under test:

 

Device firmware (base)    L1TC000118D0

Device firmware (date)    31 Aug 2015 18:36:08

Device firmware (incremental)      eng.cltbld.20150831.063552

Device firmware (release)      4.4.2

Device identifier flame

Gaia date     30 Aug 2015 08:42:30

Gaia revision       31e595f86f6b

Gecko build  20150831030202

Gecko revision    f2518b8a7b97b5bb477e94bc9131584007aac887

Gecko version     43.0a1

 

Summary:
Smoketests:

43 tests ran in 4021 seconds.

33 passed, 141 skipped, 0 failed, 8 errors.

0 expected failures, 0 unexpected passes.

 

Non-smoketests:

129 tests ran in 10739 seconds.

112 passed, 66 skipped, 4 failed, 8 errors.

4 expected failures, 0 unexpected passes.

 

Best Regards!

Verson

 



Marigold Software Engineering Inc.
Quality Management Dep.

E-mail: xiongfuchao at mgsei.com <mailto:xiongfuchao at mgsei.com> 

-------------- next part --------------
An HTML attachment was scrubbed...
URL: <http://mail.mozilla.org/pipermail/fxosqa-report-watchlist/attachments/20150901/63a9e4d9/attachment-0003.html>
-------------- next part --------------
A non-text attachment was scrubbed...
Name: image001.jpg
Type: image/jpeg
Size: 2277 bytes
Desc: not available
URL: <http://mail.mozilla.org/pipermail/fxosqa-report-watchlist/attachments/20150901/63a9e4d9/attachment-0001.jpg>
-------------- next part --------------
An HTML attachment was scrubbed...
URL: <http://mail.mozilla.org/pipermail/fxosqa-report-watchlist/attachments/20150901/63a9e4d9/attachment-0004.html>
-------------- next part --------------
An HTML attachment was scrubbed...
URL: <http://mail.mozilla.org/pipermail/fxosqa-report-watchlist/attachments/20150901/63a9e4d9/attachment-0005.html>


More information about the Fxosqa-report-watchlist mailing list