Fwd: 6/18/2015 Flame KK v18D Gaia-ui Automation v2.2 Mozilla RIL Full Flash Build 42/45 smoketests, 128/132 non-smoketests

Hermes Cheng hcheng at mozilla.com
Thu Jun 18 09:50:57 UTC 2015


Hi All,

It seems some did not receive this mail. I have opened a new service 
desk bug for it. Please see below mail for v2.2 gaia-ui automation status.

By the way, we will attend work week next week and will keep sending the 
daily report unless there is any env issue which cannot be resolved 
remotely.
Please tell me if you have any questions. Thanks. ;)

Regards,

HERMES CHENG (鄭宇翔)
Mozilla Taiwan
Phone: +886-2-87861100#277



-------- 轉寄郵件 --------
主旨: 	6/18/2015 Flame KK v18D Gaia-ui Automation v2.2 Mozilla RIL Full 
Flash Build 42/45 smoketests, 128/132 non-smoketests
日期: 	Thu, 18 Jun 2015 16:41:08 +0800
從: 	Lance(刘科) <liuke at mgsei.com>
到: 	fxosqa-report-watchlist at mozilla.org
副本 (CC): 	'Hermes Cheng' <hcheng at mozilla.com>, whsu at mozilla.com, 'Eric 
夏永东' <yongdong.xia at mgsei.com>, fan.luo at mgsei.com



*Smoketests:
Test failures - 1 replicable manually:*

**

• [Reproduced manually] test_rocketbar_add_collection_save_bookmark.py – 
Bug 1165370 <https://bugzilla.mozilla.org/show_bug.cgi?id=1165370> - 
Disable test_rocketbar_add_collection_save_bookmark.py until server-side 
issue are fixed. Reproduced it by Manually(5/5).

• [Not reproduced manually] test_setup_basic_gmail.py - Bug 1174268 
<https://bugzilla.mozilla.org/show_bug.cgi?id=1174268> - 
test_setup_basic_gmail.py: "NoSuchElementException: 
NoSuchElementException: Unable to locate element: Passwd".

• [Not reproduced manually] test_ftu_skip_tour.py - Bug 1134445 
<https://bugzilla.mozilla.org/show_bug.cgi?id=1134445> - [FTU] About 
Firefox OS page has "Yes! Send data." checked primarily.

*Expected failures / disabled tests:*

• [Disabled] test_setup_and_send_active_sync_email.py - Bug 1028192 
<https://bugzilla.mozilla.org/show_bug.cgi?id=1028192> - Problems with 
ActiveSync accounts.

• [Disabled] test_receive_active_sync_email.py - Bug 1028192 
<https://bugzilla.mozilla.org/show_bug.cgi?id=1028192> - Problems with 
ActiveSync accounts.

• [Disabled] test_cost_control_data_alert_mobile.py - Bug 1061698 
<https://bugzilla.mozilla.org/show_bug.cgi?id=1061698> - Need ability to 
work in the shadow root/shadow DOM.

• [Disabled] test_call_log_all_calls.py - Bug 1096385 
<https://bugzilla.mozilla.org/show_bug.cgi?id=1096385> - Investigate 
failure in test_call_log_all_calls.py, call log is displayed erroneously.

*Non-smoketests:
Test failures - 0 replicable manually:*

**

• [Not reproduced manually] test_import_contacts_from_gmail.py – 
Bug 1174268 <https://bugzilla.mozilla.org/show_bug.cgi?id=1174268> - 
test_setup_basic_gmail.py: "NoSuchElementException: 
NoSuchElementException: Unable to locate element: Passwd".

• [Not reproduced manually] test_import_gmail_no_network.py – 
Bug 1174268 <https://bugzilla.mozilla.org/show_bug.cgi?id=1174268> - 
test_setup_basic_gmail.py: "NoSuchElementException: 
NoSuchElementException: Unable to locate element: Passwd".

• [Not reproduced manually] test_settings_battery_power_save_mode.py - 
StaleElementException: StaleElementException: The element reference is 
stale. Either the element is no longer attached to the DOM or the page 
has been refreshed. Can’t reproduced it by Manually(0/5).

**

*Expected failures / disabled tests:*

**

• [Disabled] test_ftu_skip_tour_desktopb2g.py - Test runs only on desktop.

• [Disabled] test_settings_sim_manager.py - Test requires device with 2 
sims.

• [Disabled] test_fmradio_find_stations.py - Bug 1000863 
<https://bugzilla.mozilla.org/show_bug.cgi?id=1000863> - Investigate 
test_fmradio_find_stations.py failure.

• [Disabled] test_dialer_set_up_conference.py - Bug 1117813 
<https://bugzilla.mozilla.org/show_bug.cgi?id=1117813> - Make PlivoUtil 
use a valid 'answer_url' with a valid Plivo XML.

• [Expected Failure] test_call_log_groups.py - Bug 1117804 
<https://bugzilla.mozilla.org/show_bug.cgi?id=1117804> - [v2.2] 
Investigate test_call_log_groups failure.

*Build under test:*

Device firmware (base)    L1TC100118D0

Device firmware (date)    17 Jun 2015 16:04:34

Device firmware (incremental)      eng.cltbld.20150617.040422

Device firmware (release)      4.4.2

Device identifier        flame

Gaia date     17 Jun 2015 06:04:56

Gaia revision       3414b07dc489

Gecko build 20150617002504

Gecko revision    a2db74491088

Gecko version     37.0

*Summary:*
*Smoketests:*

45 tests ran in 3896 seconds.

42 passed, 130 skipped, 1 failed, 2 errors.

0 expected failures, 0 unexpected passes.

*Non-smoketests:*

132 tests ran in 9624 seconds.

128 passed, 55 skipped, 1 failed, 3 errors.

0 expected failures, 0 unexpected passes.

*The reports path:*

http://mozilla-twqa.github.io/Gaiatest-Reports/2015/06/20150617002504-v2.2-flame/index.html

Best Regards!

Lance

cid:image001.jpg at 01CA63C3.1FDE10E0

*Marigold Software Engineering Inc.
Quality Management Dep.*
E-mail:liuke at mgsei.com <mailto:liuke at mgsei.com>



-------------- next part --------------
An HTML attachment was scrubbed...
URL: <http://mail.mozilla.org/pipermail/fxosqa-report-watchlist/attachments/20150618/6eccf157/attachment-0003.html>
-------------- next part --------------
A non-text attachment was scrubbed...
Name: not available
Type: image/jpeg
Size: 2277 bytes
Desc: not available
URL: <http://mail.mozilla.org/pipermail/fxosqa-report-watchlist/attachments/20150618/6eccf157/attachment-0001.jpe>
-------------- next part --------------
An HTML attachment was scrubbed...
URL: <http://mail.mozilla.org/pipermail/fxosqa-report-watchlist/attachments/20150618/6eccf157/attachment-0004.html>
-------------- next part --------------
An HTML attachment was scrubbed...
URL: <http://mail.mozilla.org/pipermail/fxosqa-report-watchlist/attachments/20150618/6eccf157/attachment-0005.html>


More information about the Fxosqa-report-watchlist mailing list