06/16/2015 Flame KK v18D-1 319 MB Gaia-ui Automation mozilla-central Mozilla RIL Full Flash Build 38/43 smoketests, 121/129 non-smoketests

Oliver Nelson onelson at qanalydocs.com
Tue Jun 16 19:20:25 UTC 2015


*Smoketests:*
http://jenkins1.qa.scl3.mozilla.com/view/UI/job/flame-kk-319.mozilla-central.nightly.ui.functional.smoke.bitbar/234/

*Test failures - 0 replicable manually:*

   - [No manual error, new UI flow] test_setup_basic_gmail -
   https://bugzil.la/1174268 - NoSuchElementException: Unable to locate
   element: Passwd
   - [Not reproduced manually] test_browser_lan -- Not reproduced via
   Jenkins adhoc; 5/5 passing
   - [Not reproduced manually] test_dialer_receive_call --
   https://bugzil.la/1097754 - Plivo didn't report the call as completed
   - [Not reproduced manually] test_dialer_receive_call_with_locked_screen
   -- https://bugzil.la/1097754 - Plivo didn't report the call as completed
   - [Not reproduced manually]
   test_lockscreen_unlock_to_camera_with_passcode -- Not reproduced via
   Jenkins adhoc; 5/5 passing

*Expected failures / disabled tests:*

   - [Disabled] test_rocketbar_add_collection_save_bookmark -
   https://bugzil.la/1162112 - TimeoutException: TimeoutException: Timed
   out after 30.1 seconds
   - [Disabled] test_call_log_all_calls.py - https://bugzil.la/1096385 -
   Investigate failure in test_call_log_all_calls.py, call log is displayed
   erroneously
   - [Disabled] test_dialer_set_up_conference_call.py -
   https://bugzil.la/1117813 Make PlivoUtil use a valid 'answer_url' with a
   valid Plivo XML
   - [Disabled] test_setup_and_send_active_sync_email.py -
   https://bugzil.la/1028192 - Problems with ActiveSync accounts
   - [Disabled] test_receive_active_sync_email.py -
   https://bugzil.la/1028192 - Problems with ActiveSync accountsc
   - [Disabled] test_fmradio_find_stations.py - https://bugzil.la/1000863
   Investigate test_fmradio_find_stations.py failure
   - [Disabled] test_ftu_skip_tour_desktopb2g.py - Desktop Only
   - [Disabled] test_settings_bluetooth.py - Bug 1134244 -
   test_settings_bluetooth.py:test_toggle_bluetooth_settings is failing on
   bluetooth_settings.enable_visible_to_all()
   - [Disabled] test_settings_airplane_mode.py - https://bugzil.la/1131070


*Non-smoketests:*

http://jenkins1.qa.scl3.mozilla.com/view/UI/job/flame-kk-319.mozilla-central.nightly.ui.functional.non-smoke.1.bitbar/109/
http://jenkins1.qa.scl3.mozilla.com/view/UI/job/flame-kk-319.mozilla-central.nightly.ui.functional.non-smoke.2.bitbar/109/


*Test failures - 0 replicable manually:*

   - [No manual error; new UI flow] test_import_contacts_from_gmail --
   https://bugzil.la/1174268 - NoSuchElementException: Unable to locate
   element: Passwd
   - [Not reproduced manually]
   test_sms_notification_removed_when_sms_deleted -
   https://bugzil.la/1172460 - Intermittent failure in
   wait_for_notification_toaster_displayed
   - [Not reproduced manually] test_sms_notification -
   https://bugzil.la/1172618 - TimeoutException: Timed out after 300.1
   seconds with message: Notification did not appear.
   - [Not reproduced manually]
   test_dialer_miss_call_from_known_contact_notification -- Appears to be this
   issue: https://bugzil.la/1097754 - Plivo didn't report the call as
   completed
   - [Not reproduced manually] test_dialer_receive_call_with_contact_photo
   -- Not reproduced via Jenkins adhoc; 5/5 passing
   - [Not reproduced manually]
   test_add_to_an_existing_contact_from_messages -- Not reproduced via Jenkins
   adhoc; 5/5 passing
   - [Not reproduced manually] test_settings_passcode - New Error:
   https://bugzil.la/1175244 - TimeoutException: Timed out after 10.6
   seconds


*Expected failures / disabled tests:*

   - [Expected fail] test_lockscreen_time_check - https://bugzil.la/1157316
   - JavascriptException: TypeError: document.getElementById(...) is null
   - [Expected fail] test_import_gmail_no_network.py -
   https://bugzil.la/1155763 -xfail
   - [Expected fail] test_settings_change_time_format -
   https://bugzil.la/1141654 test_settings_change_time_format consistently
   failing, seems to hang and fail on the homescreen
   - [Expected fail] test_call_log_groups.TestCallLogGroups -
   https://bugzil.la/1117804 - [v2.2] Investigate test_call_log_groups
   failure
   - [Expected fail] test_change_language_settings_rtl -
   https://bugzil.la/1137766 - Error in both test_settings_change_language
   tests: exception "Element '%s' could not be foundin select wrapper"
   - [Expected fail] test_change_language_settings -
   https://bugzil.la/1137766 - Error in both test_settings_change_language
   tests: exception "Element '%s' could not be foundin select wrapper"
   - [Disabled] test_call_log_all_calls.py - https://bugzil.la/1096385 -
   Investigate failure in test_call_log_all_calls.py, call log is displayed
   erroneously
   - [Disabled] test_dialer_set_up_conference_call.py -
   https://bugzil.la/1117813 - Make PlivoUtil use a valid 'answer_url' with
   a valid Plivo XML
   - [Disabled] test_setup_and_send_active_sync_email.py - Bug 1028192 -
   Problems with ActiveSync accounts
   - [Disabled] test_receive_active_sync_email.py -
   https://bugzil.la/1028192 - Problems with ActiveSync accounts
   - [Disabled] test_fmradio_find_stations.py - https://bugzil.la/1000863 -
   Investigate test_fmradio_find_stations.py failure
   - [Disabled] test_ftu_skip_tour_desktopb2g.py - Test runs only on desktop
   - [Disabled] test_settings_bluetooth.py - https://bugzil.la/1134244 -
   test_settings_bluetooth.py:test_toggle_bluetooth_settings is failing on
   bluetooth_settings.enable_visible_to_all()
   - [Disabled] test_settings_airplane_mode.py - https://bugzil.la/1131070



*Build under test:*
Device firmware (base)     L1TC100118D0
Device firmware (date)     16 Jun 2015 10:09:36
Device firmware (incremental)     eng.cltbld.20150616.060924
Device firmware (release)     4.4.2
Device identifier     flame
Device memory     219772 kB
Device serial     94fdce95
Device uptime     0 days 0 hours 2 minutes 40 seconds
Gaia date     15 Jun 2015 19:09:24
Gaia revision     62ba52866f4e
Gecko build     20150616010205
Gecko revision     ce863f9d8864
Gecko version     41.0a1

*Summary:*

*Smoketests:*

179 tests ran in 4785.0 seconds.
38 passed, 136 skipped, 0 failed, 5 errors.
0 expected failures, 0 unexpected passes.

*Non-smoketest:*

124 tests ran in 6750.4 seconds.
57 passed, 59 skipped, 0 failed, 6 errors.
2 expected failures, 0 unexpected passes.

126 tests ran in 5753.9 seconds.
64 passed, 59 skipped, 0 failed, 1 errors.
2 expected failures, 0 unexpected passes.
-------------- next part --------------
An HTML attachment was scrubbed...
URL: <http://mail.mozilla.org/pipermail/fxosqa-report-watchlist/attachments/20150616/e7fb44e9/attachment.html>


More information about the Fxosqa-report-watchlist mailing list