06/15/2015 Flame KK v18D-1 319 MB Gaia-ui Automation mozilla-central Mozilla RIL Full Flash Build 37/42 smoketests, 99/129 non-smoketests

Oliver Nelson onelson at qanalydocs.com
Mon Jun 15 18:53:12 UTC 2015


*Smoketests:*
http://jenkins1.qa.scl3.mozilla.com/view/UI/job/flame-kk-319.mozilla-central.nightly.ui.functional.smoke.bitbar/230/

*Test failures - 0 replicable manually:*

   - [No manual error, new UI flow] test_setup_basic_gmail -
   https://bugzil.la/1174268 - NoSuchElementException: Unable to locate
   element: Passwd
   - [Not reproduced manually] test_settings_cell_data -- Not reproduced
   via Jenkins adhoc; 5/5 passing
   - [Not reproduced manually] test_settings_usb_storage -- Not reproduced
   via Jenkins adhoc; 5/5 passing
   - [Not reproduced manually] test_power_button_long_press -- Not
   reproduced via Jenkins adhoc; 5/5 passing
   - [Not reproduced manually] test_play_3gp_video -- Reproduced via
   Jenkins adhoc; 4/5 passing


*Expected failures / disabled tests:*

   - [Expected fail] test_ftu_skip_tour.TestFtu - https://bugzil.la/1134257
   Default value for 'About Firefox OS, Yes! Send Data.' causing fail in
   ftu_skip_tour
   - [Disabled] test_rocketbar_add_collection_save_bookmark -
   https://bugzil.la/1162112 - TimeoutException: TimeoutException: Timed
   out after 30.1 seconds
   - [Disabled] test_call_log_all_calls.py - https://bugzil.la/1096385 -
   Investigate failure in test_call_log_all_calls.py, call log is displayed
   erroneously
   - [Disabled] test_dialer_set_up_conference_call.py -
   https://bugzil.la/1117813 Make PlivoUtil use a valid 'answer_url' with a
   valid Plivo XML
   - [Disabled] test_setup_and_send_active_sync_email.py -
   https://bugzil.la/1028192 - Problems with ActiveSync accounts
   - [Disabled] test_receive_active_sync_email.py -
   https://bugzil.la/1028192 - Problems with ActiveSync accountsc
   - [Disabled] test_fmradio_find_stations.py - https://bugzil.la/1000863
   Investigate test_fmradio_find_stations.py failure
   - [Disabled] test_ftu_skip_tour_desktopb2g.py - Desktop Only
   - [Disabled] test_settings_bluetooth.py - Bug 1134244 -
   test_settings_bluetooth.py:test_toggle_bluetooth_settings is failing on
   bluetooth_settings.enable_visible_to_all()
   - [Disabled] test_settings_airplane_mode.py - https://bugzil.la/1131070


*Non-smoketests:*

http://jenkins1.qa.scl3.mozilla.com/view/UI/job/flame-kk-319.mozilla-central.nightly.ui.functional.non-smoke.1.bitbar/105/
http://jenkins1.qa.scl3.mozilla.com/view/UI/job/flame-kk-319.mozilla-central.nightly.ui.functional.non-smoke.2.bitbar/106/


*Test failures - 0 replicable manually:*

*non-smoke.1:*

   - [Not reproduced manually]
   test_sms_notification_removed_when_sms_deleted -
   https://bugzil.la/1172460 - Intermittent failure in
   wait_for_notification_toaster_displayed

*bug 1172343 IO errors*
** Unable to perform tests timely due to https://bugzil.la/1173416 --
devices consistently failing to flash, failing build
* test_settings_passcode
* test_settings_device_info
* test_settings_battery_power_save_mode
* test_settings_change_ring_tone
* test_geolocation_prompt
* test_system_message
* test_inter_app_comm
* test_privileged_app_video_capture_prompt
* test_privileged_app_device_music_prompt
* test_privileged_app_device_sdcard_prompt
* test_privileged_app_geolocation_prompt
* test_play_ogv_video
* test_play_mp4_video

*non-smoke.2:*
** Unable to perform tests timely due to https://bugzil.la/1173416 --
devices consistently failing to flash, failing build
[No manual error; new UI flow] test_import_contacts_from_gmail --
https://bugzil.la/1174268 - NoSuchElementException: Unable to locate
element: Passwd

*bug 1172343 IO errors*
** Unable to perform tests timely due to https://bugzil.la/1173416 --
devices consistently failing to flash, failing build
* test_settings_wallpaper
* test_settings_change_keyboard_language
* test_settings_power_save_mode
* test_settings_root
* test_system_notification_bar
* test_quick_settings
* test_system_message_pending
* test_privileged_app_audio_capture_prompt
* test_privileged_app_contacts_prompt
* test_privileged_app_device_picture_prompt
* test_privileged_app_device_video_prompt
* test_video_empty
* test_play_webm_video
* test_play_ogg_video

*Expected failures / disabled tests:*

   - [Expected fail] test_lockscreen_time_check - https://bugzil.la/1157316
   - JavascriptException: TypeError: document.getElementById(...) is null
   - [Expected fail] test_import_gmail_no_network.py -
   https://bugzil.la/1155763 -xfail
   - [Expected fail] test_settings_change_time_format -
   https://bugzil.la/1141654 test_settings_change_time_format consistently
   failing, seems to hang and fail on the homescreen
   - [Expected fail] test_call_log_groups.TestCallLogGroups -
   https://bugzil.la/1117804 - [v2.2] Investigate test_call_log_groups
   failure
   - [Expected fail] test_change_language_settings_rtl -
   https://bugzil.la/1137766 - Error in both test_settings_change_language
   tests: exception "Element '%s' could not be foundin select wrapper"
   - [Expected fail] test_change_language_settings -
   https://bugzil.la/1137766 - Error in both test_settings_change_language
   tests: exception "Element '%s' could not be foundin select wrapper"
   - [Disabled] test_call_log_all_calls.py - https://bugzil.la/1096385 -
   Investigate failure in test_call_log_all_calls.py, call log is displayed
   erroneously
   - [Disabled] test_dialer_set_up_conference_call.py -
   https://bugzil.la/1117813 - Make PlivoUtil use a valid 'answer_url' with
   a valid Plivo XML
   - [Disabled] test_setup_and_send_active_sync_email.py - Bug 1028192 -
   Problems with ActiveSync accounts
   - [Disabled] test_receive_active_sync_email.py -
   https://bugzil.la/1028192 - Problems with ActiveSync accounts
   - [Disabled] test_fmradio_find_stations.py - https://bugzil.la/1000863 -
   Investigate test_fmradio_find_stations.py failure
   - [Disabled] test_ftu_skip_tour_desktopb2g.py - Test runs only on desktop
   - [Disabled] test_settings_bluetooth.py - https://bugzil.la/1134244 -
   test_settings_bluetooth.py:test_toggle_bluetooth_settings is failing on
   bluetooth_settings.enable_visible_to_all()
   - [Disabled] test_settings_airplane_mode.py - https://bugzil.la/1131070


*Build under test:*

Device firmware (base)     L1TC100118D0
Device firmware (date)     15 Jun 2015 08:48:05
Device firmware (incremental)     eng.cltbld.20150615.044754
Device firmware (release)     4.4.2
Device identifier     flame
Device memory     219772 kB
Device serial     94f7ce17
Device uptime     0 days 0 hours 2 minutes 9 seconds
Gaia date     13 Jun 2015 00:22:05
Gaia revision     1bf2da102560
Gecko build     20150615010203
Gecko revision     3c26bef95d54
Gecko version     41.0a1

*Summary:*

*Smoketests:*

179 tests ran in 5006.9 seconds.
37 passed, 136 skipped, 0 failed, 5 errors.
1 expected failures, 0 unexpected passes.

*Non-smoketest:*

124 tests ran in 7615.9 seconds.
49 passed, 59 skipped, 0 failed, 14 errors.
2 expected failures, 0 unexpected passes.

126 tests ran in 7315.8 seconds.
50 passed, 59 skipped, 0 failed, 15 errors.
2 expected failures, 0 unexpected passes.
-------------- next part --------------
An HTML attachment was scrubbed...
URL: <http://mail.mozilla.org/pipermail/fxosqa-report-watchlist/attachments/20150615/d9ad9f26/attachment.html>


More information about the Fxosqa-report-watchlist mailing list