06/12/2015 Flame KK v18D-1 319 MB Gaia-ui Automation mozilla-central Mozilla RIL Full Flash Build 33/42 smoketests, 93/129 non-smoketests

Oliver Nelson onelson at qanalydocs.com
Fri Jun 12 19:47:11 UTC 2015


*Smoketests:*
http://jenkins1.qa.scl3.mozilla.com/view/UI/job/flame-kk-319.mozilla-central.nightly.ui.functional.smoke.bitbar/224/

*Test failures - 0 replicable manually:*
*
http://jenkins1.qa.scl3.mozilla.com/view/UI/job/flame-kk.ui.adhoc.bitbar/100/console
** Unable to perform tests timely due to https://bugzil.la/1173416 --
devices consistently failing to flash, failing build
* 3 failed runs

   - [No manual error, new UI flow] test_setup_basic_gmail -
   https://bugzil.la/1174268 - NoSuchElementException: Unable to locate
   element: Passwd
   - [Not reproduced manually] test_fmradio_frequency_dialer
   - [Not reproduced manually]
   test_lockscreen_unlock_to_camera_with_passcode
   - [Not reproduced manually] test_sms_contact.py
   - [Not reproduced manually] test_dialer_receive_call.py --
   https://bugzil.la/1174282 - NoSuchElementException: Unable to locate
   element: .handled-call.incoming
   - [Not reproduced manually]
   test_dialer_receive_call_with_locked_screen.py --
   https://bugzil.la/1174282 - NoSuchElementException: Unable to locate
   element: .handled-call.incoming
   - [Not reproduced manually] test_sms.py
   - [Not reproduced manually] test_sms_with_attachments.py
   - [Not reproduced manually] test_sms_with_picture_attached.py


*Expected failures / disabled tests:*

   - [Expected fail] test_ftu_skip_tour.TestFtu - https://bugzil.la/1134257
   Default value for 'About Firefox OS, Yes! Send Data.' causing fail in
   ftu_skip_tour
   - [Disabled] test_rocketbar_add_collection_save_bookmark -
   https://bugzil.la/1162112 - TimeoutException: TimeoutException: Timed
   out after 30.1 seconds
   - [Disabled] test_call_log_all_calls.py - https://bugzil.la/1096385 -
   Investigate failure in test_call_log_all_calls.py, call log is displayed
   erroneously
   - [Disabled] test_dialer_set_up_conference_call.py -
   https://bugzil.la/1117813 Make PlivoUtil use a valid 'answer_url' with a
   valid Plivo XML
   - [Disabled] test_setup_and_send_active_sync_email.py -
   https://bugzil.la/1028192 - Problems with ActiveSync accounts
   - [Disabled] test_receive_active_sync_email.py -
   https://bugzil.la/1028192 - Problems with ActiveSync accountsc
   - [Disabled] test_fmradio_find_stations.py - https://bugzil.la/1000863
   Investigate test_fmradio_find_stations.py failure
   - [Disabled] test_ftu_skip_tour_desktopb2g.py - Desktop Only
   - [Disabled] test_settings_bluetooth.py - Bug 1134244 -
   test_settings_bluetooth.py:test_toggle_bluetooth_settings is failing on
   bluetooth_settings.enable_visible_to_all()
   - [Disabled] test_settings_airplane_mode.py - https://bugzil.la/1131070


*Non-smoketests:*

http://jenkins1.qa.scl3.mozilla.com/view/UI/job/flame-kk-319.mozilla-central.nightly.ui.functional.non-smoke.1.bitbar/99/
http://jenkins1.qa.scl3.mozilla.com/view/UI/job/flame-kk-319.mozilla-central.nightly.ui.functional.non-smoke.2.bitbar/100/

*Test failures - 0 replicable manually:*

*non-smoke.1:*

   - [Not reproduced manually]
   test_dialer_miss_call_from_known_contact_notification --
   https://bugzil.la/1174282 - NoSuchElementException: Unable to locate
   element: .handled-call.incoming
   - [Not reproduced manually] test_dialer_receive_call_with_contact_photo
   -- https://bugzil.la/1174282 - NoSuchElementException: Unable to locate
   element: .handled-call.incoming
   - [Not reproduced manually]
   test_add_to_an_existing_contact_from_messages -- Reproduced via Jenkins
   adhoc; 0/3 passing. Believe this is the same as bug 1172460
   - [Not reproduced manually]
   test_sms_notification_removed_when_sms_deleted -
   https://bugzil.la/1172460 - Intermittent failure in
   wait_for_notification_toaster_displayed
   - [Not reproduced manually] test_sms_notification -
   https://bugzil.la/1172618 - TimeoutException: Timed out after 300.1
   seconds with message: Notification did not appear

*bug 1172343 IO errors*
** Unable to perform tests timely due to https://bugzil.la/1173416 --
devices consistently failing to flash, failing build
* test_settings_passcode
* test_settings_device_info
* test_settings_battery_power_save_mode
* test_settings_change_ring_tone
* test_geolocation_prompt
* test_system_message
* test_inter_app_comm
* test_privileged_app_video_capture_prompt
* test_privileged_app_device_music_prompt
* test_privileged_app_device_sdcard_prompt
* test_privileged_app_geolocation_prompt
* test_play_ogv_video
* test_play_mp4_video

*non-smoke.2:*
** Unable to perform tests timely due to https://bugzil.la/1173416 --
devices consistently failing to flash, failing build

   - [No manual error; new UI flow] test_import_contacts_from_gmail --
   https://bugzil.la/1174268 - NoSuchElementException: Unable to locate
   element: Passwd
   - [Not reproduced manually] test_browser_share_link -- Not reproduced
   via Jenkins adhoc; 3/3 passing
   - [Not reproduced manually] test_homescreen_column_layout -- Not
   reproduced via Jenkins adhoc; 3/3 passing

*bug 1172343 IO errors*
** Unable to perform tests timely due to https://bugzil.la/1173416 --
devices consistently failing to flash, failing build
* test_settings_wallpaper
* test_settings_change_keyboard_language
* test_settings_power_save_mode
* test_settings_root
* test_system_notification_bar
* test_quick_settings
* test_system_message_pending
* test_privileged_app_audio_capture_prompt
* test_privileged_app_contacts_prompt
* test_privileged_app_device_picture_prompt
* test_privileged_app_device_video_prompt
* test_video_empty
* test_play_webm_video
* test_play_ogg_video


*Expected failures / disabled tests:*

   - [Expected fail] test_lockscreen_time_check - https://bugzil.la/1157316
   - JavascriptException: TypeError: document.getElementById(...) is null
   - [Expected fail] test_import_gmail_no_network.py -
   https://bugzil.la/1155763 -xfail
   - [Expected fail] test_settings_change_time_format -
   https://bugzil.la/1141654 test_settings_change_time_format consistently
   failing, seems to hang and fail on the homescreen
   - [Expected fail] test_call_log_groups.TestCallLogGroups -
   https://bugzil.la/1117804 - [v2.2] Investigate test_call_log_groups
   failure
   - [Expected fail] test_change_language_settings_rtl -
   https://bugzil.la/1137766 - Error in both test_settings_change_language
   tests: exception "Element '%s' could not be foundin select wrapper"
   - [Expected fail] test_change_language_settings -
   https://bugzil.la/1137766 - Error in both test_settings_change_language
   tests: exception "Element '%s' could not be foundin select wrapper"
   - [Disabled] test_call_log_all_calls.py - https://bugzil.la/1096385 -
   Investigate failure in test_call_log_all_calls.py, call log is displayed
   erroneously
   - [Disabled] test_dialer_set_up_conference_call.py -
   https://bugzil.la/1117813 - Make PlivoUtil use a valid 'answer_url' with
   a valid Plivo XML
   - [Disabled] test_setup_and_send_active_sync_email.py - Bug 1028192 -
   Problems with ActiveSync accounts
   - [Disabled] test_receive_active_sync_email.py -
   https://bugzil.la/1028192 - Problems with ActiveSync accounts
   - [Disabled] test_fmradio_find_stations.py - https://bugzil.la/1000863 -
   Investigate test_fmradio_find_stations.py failure
   - [Disabled] test_ftu_skip_tour_desktopb2g.py - Test runs only on desktop
   - [Disabled] test_settings_bluetooth.py - https://bugzil.la/1134244 -
   test_settings_bluetooth.py:test_toggle_bluetooth_settings is failing on
   bluetooth_settings.enable_visible_to_all()
   - [Disabled] test_settings_airplane_mode.py - https://bugzil.la/1131070


*Build under test:*

Device firmware (base)     L1TC100118D0
Device firmware (date)     12 Jun 2015 08:30:09
Device firmware (incremental)     eng.cltbld.20150612.042958
Device firmware (release)     4.4.2
Device identifier     flame
Device memory     219772 kB
Device serial     f0314099
Device uptime     0 days 0 hours 2 minutes 19 seconds
Gaia date     11 Jun 2015 18:09:27
Gaia revision     9f36b711af75
Gecko build     20150612010203
Gecko revision     0093691d3715
Gecko version     41.0a1

*Summary:*

*Smoketests:*

179 tests ran in 5656.5 seconds.
33 passed, 136 skipped, 0 failed, 9 errors.
1 expected failures, 0 unexpected passes.

*Non-smoketest:*

124 tests ran in 8113.4 seconds.
45 passed, 59 skipped, 0 failed, 18 errors.
2 expected failures, 0 unexpected passes.

126 tests ran in 7283.8 seconds.
48 passed, 59 skipped, 0 failed, 17 errors.
2 expected failures, 0 unexpected passes.
-------------- next part --------------
An HTML attachment was scrubbed...
URL: <http://mail.mozilla.org/pipermail/fxosqa-report-watchlist/attachments/20150612/87d2a360/attachment-0001.html>


More information about the Fxosqa-report-watchlist mailing list