06/09/2015 Flame KK v18D-1 319 MB Gaia-ui Automation mozilla-central Mozilla RIL Full Flash Build 37/42 smoketests, 94/129 non-smoketests

Oliver Nelson onelson at qanalydocs.com
Tue Jun 9 17:53:04 UTC 2015


*Smoketests:*
http://jenkins1.qa.scl3.mozilla.com/view/UI/job/flame-kk-319.mozilla-central.nightly.ui.functional.smoke.bitbar/217/

*Test failures - 0 replicable manually:*

   - [Not reproduced manually] test_edit_contact - Not reproduced via
   Jenkins adhoc; 5/5 passing

*bug 1172343 IO error -- Performed adhoc with no repeat to run through
tests*
*
http://jenkins1.qa.scl3.mozilla.com/view/UI/job/flame-kk.ui.adhoc.bitbar/82/HTML_Report/

   - [Pass] test_settings_cell_data
   - [Pass] test_settings_usb_storage
   - [Pass] test_power_button_long_press
   - [Pass] test_play_3gp_video

*Expected failures / disabled tests:*

   - [Expected fail] test_ftu_skip_tour.TestFtu - https://bugzil.la/1134257
   Default value for 'About Firefox OS, Yes! Send Data.' causing fail in
   ftu_skip_tour
   - [Disabled] test_rocketbar_add_collection_save_bookmark -
   https://bugzil.la/1162112 - TimeoutException: TimeoutException: Timed
   out after 30.1 seconds
   - [Disabled] test_call_log_all_calls.py - https://bugzil.la/1096385 -
   Investigate failure in test_call_log_all_calls.py, call log is displayed
   erroneously
   - [Disabled] test_dialer_set_up_conference_call.py -
   https://bugzil.la/1117813 Make PlivoUtil use a valid 'answer_url' with a
   valid Plivo XML
   - [Disabled] test_setup_and_send_active_sync_email.py -
   https://bugzil.la/1028192 - Problems with ActiveSync accounts
   - [Disabled] test_receive_active_sync_email.py -
   https://bugzil.la/1028192 - Problems with ActiveSync accountsc
   - [Disabled] test_fmradio_find_stations.py - https://bugzil.la/1000863
   Investigate test_fmradio_find_stations.py failure
   - [Disabled] test_ftu_skip_tour_desktopb2g.py - Desktop Only
   - [Disabled] test_homescreen_column_layout.py - https://bugzil.la/1131037
   Settings OoM and placing test in unexpected location
   - [Disabled] test_settings_bluetooth.py - Bug 1134244 -
   test_settings_bluetooth.py:test_toggle_bluetooth_settings is failing on
   bluetooth_settings.enable_visible_to_all()
   - [Disabled] test_settings_airplane_mode.py - https://bugzil.la/1131070


*Non-smoketests:*

http://jenkins1.qa.scl3.mozilla.com/view/UI/job/flame-kk-319.mozilla-central.nightly.ui.functional.non-smoke.1.bitbar/91/
http://jenkins1.qa.scl3.mozilla.com/view/UI/job/flame-kk-319.mozilla-central.nightly.ui.functional.non-smoke.2.bitbar/91/

*Test failures - 0 replicable manually:*

*non-smoke.1:*

   - [Not reproduced manually] test_sync_facebook_contacts - Reproduced via
   Jenkins adhoc; 3/5 passing
   - [Not reproduced manually] test_email_one_header_displayed - Not
   reproduced via Jenkins adhoc; 5/5 passing
   - [Not reproduced manually] test_sms_notification -
   https://bugzil.la/1172618 - TimeoutException: Timed out after 300.1
   seconds with message: Notification did not appear

*bug 1172343 IO error -- Performed adhoc with no repeat to run through
tests*
*
http://jenkins1.qa.scl3.mozilla.com/view/UI/job/flame-kk.ui.adhoc.bitbar/80/HTML_Report/

   - [Pass] test_settings_media_storage
   - [Pass] test_settings_passcode
   - [Pass] test_settings_device_info -- Not reproduced manually
   - [Pass] test_settings_battery_power_save_mode
   - [Pass] test_settings_change_ring_tone
   - [Pass] test_geolocation_prompt
   - [Pass] test_system_message
   - [Pass] test_inter_app_comm
   - [Pass] test_privileged_app_video_capture_prompt
   - [Pass] test_privileged_app_device_music_prompt
   - [Pass] test_privileged_app_device_sdcard_prompt
   - [Pass] test_privileged_app_geolocation_prompt
   - [Pass] test_play_ogv_video
   - [Pass] test_play_mp4_video


*non-smoke.2:*

   - [Not reproduced manually] test_gallery_handle_valid_image_file - Not
   reproduced via Jenkins adhoc; 5/5 passing

*bug 1172343 IO error -- Performed adhoc with no repeat to run through
tests*
*
http://jenkins1.qa.scl3.mozilla.com/view/UI/job/flame-kk.ui.adhoc.bitbar/83/HTML_Report/

   - [Pass] test_settings_wallpaper
   - [Pass] test_dialer_clear_miss_call_notification
   - [Pass] test_add_to_new_contact_from_messages
   - [Pass] test_settings_change_keyboard_language
   - [Pass] test_settings_power_save_mode
   - [Pass] test_settings_root
   - [Pass] test_system_notification_bar
   - [Pass] test_quick_settings
   - [Pass] test_system_message_pending
   - [Pass] test_privileged_app_audio_capture_prompt
   - [Pass] test_privileged_app_contacts_prompt
   - [Pass] test_privileged_app_device_picture_prompt
   - [Pass] test_privileged_app_device_video_prompt
   - [Pass] test_video_empty
   - [Pass] test_play_webm_video
   - [Pass] test_play_ogg_video


*Expected failures / disabled tests:*

   - [Expected fail] test_lockscreen_time_check - https://bugzil.la/1157316
   - JavascriptException: TypeError: document.getElementById(...) is null
   - [Expected fail] test_import_gmail_no_network.py -
   https://bugzil.la/1155763 -xfail
   - [Expected fail] test_settings_change_time_format -
   https://bugzil.la/1141654 test_settings_change_time_format consistently
   failing, seems to hang and fail on the homescreen
   - [Expected fail] test_call_log_groups.TestCallLogGroups -
   https://bugzil.la/1117804 - [v2.2] Investigate test_call_log_groups
   failure
   - [Expected fail] test_change_language_settings_rtl -
   https://bugzil.la/1137766 - Error in both test_settings_change_language
   tests: exception "Element '%s' could not be foundin select wrapper"
   - [Expected fail] test_change_language_settings -
   https://bugzil.la/1137766 - Error in both test_settings_change_language
   tests: exception "Element '%s' could not be foundin select wrapper"
   - [Disabled] test_call_log_all_calls.py - https://bugzil.la/1096385 -
   Investigate failure in test_call_log_all_calls.py, call log is displayed
   erroneously
   - [Disabled] test_dialer_set_up_conference_call.py -
   https://bugzil.la/1117813 - Make PlivoUtil use a valid 'answer_url' with
   a valid Plivo XML
   - [Disabled] test_setup_and_send_active_sync_email.py - Bug 1028192 -
   Problems with ActiveSync accounts
   - [Disabled] test_receive_active_sync_email.py -
   https://bugzil.la/1028192 - Problems with ActiveSync accounts
   - [Disabled] test_fmradio_find_stations.py - https://bugzil.la/1000863 -
   Investigate test_fmradio_find_stations.py failure
   - [Disabled] test_ftu_skip_tour_desktopb2g.py - Test runs only on desktop
   - [Disabled] test_homescreen_column_layout.py - https://bugzil.la/1131037
   - Homescreen settings sub-menu not displayed when going to homecreen and
   back
   - [Disabled] test_settings_bluetooth.py - https://bugzil.la/1134244 -
   test_settings_bluetooth.py:test_toggle_bluetooth_settings is failing on
   bluetooth_settings.enable_visible_to_all()
   - [Disabled] test_settings_airplane_mode.py - https://bugzil.la/1131070


*Build under test:*

Device firmware (base)     L1TC100118D0
Device firmware (date)     08 Jun 2015 23:40:19
Device firmware (incremental)     eng.cltbld.20150608.194006
Device firmware (release)     4.4.2
Device identifier     flame
Device memory     219772 kB
Device serial     374ecef6
Device uptime     0 days 0 hours 2 minutes 7 seconds
Gaia date     08 Jun 2015 03:06:41
Gaia revision     ea27c4ed5b60
Gecko build     20150608160934
Gecko revision     e10e2e8d8bf2
Gecko version     41.0a1

*Summary:*

*Smoketests:*

179 tests ran in 4964.6 seconds.
37 passed, 136 skipped, 0 failed, 5 errors.
1 expected failures, 0 unexpected passes.

*Non-smoketest:*

124 tests ran in 7289.3 seconds.
46 passed, 59 skipped, 1 failed, 16 errors.
2 expected failures, 0 unexpected passes.

126 tests ran in 7353.9 seconds.
48 passed, 59 skipped, 0 failed, 17 errors.
2 expected failures, 0 unexpected passes.
-------------- next part --------------
An HTML attachment was scrubbed...
URL: <http://mail.mozilla.org/pipermail/fxosqa-report-watchlist/attachments/20150609/5ecf021b/attachment.html>


More information about the Fxosqa-report-watchlist mailing list