06/01/2015 Flame KK v18D-1 319 MB Gaia-ui Automation mozilla-central Mozilla RIL Full Flash Build 0/43 smoketests, 0/129 non-smoketests

Peter Bylenga pbylenga at qanalydocs.com
Tue Jun 2 21:37:33 UTC 2015


Sorry for delay, this appears to have not been forwarded to the lists
yesterday.

*Smoketests:*

http://jenkins1.qa.scl3.mozilla.com/view/UI/job/flame-kk-319.mozilla-central.nightly.ui.functional.smoke.bitbar/192/

*Test Failures* - All tests failed due to timeout issue (
https://bugzil.la/1170175). On ad-hoc re-run these issues were not
reproduced.

*Expected failures / disabled tests:*

   - [Expected fail] test_ftu_skip_tour.TestFtu - https://bugzil.la/1134257
   Default value for 'About Firefox OS, Yes! Send Data.' causing fail in
   ftu_skip_tour
   - [Disabled] test_call_log_all_calls.py - https://bugzil.la/1096385 -
   Investigate failure in test_call_log_all_calls.py, call log is displayed
   erroneously
   - [Disabled] test_dialer_set_up_conference_call.py -
   https://bugzil.la/1117813 Make PlivoUtil use a valid 'answer_url' with a
   valid Plivo XML
   - [Disabled] test_setup_and_send_active_sync_email.py -
   https://bugzil.la/1028192 - Problems with ActiveSync accounts
   - [Disabled] test_receive_active_sync_email.py -
   https://bugzil.la/1028192 - Problems with ActiveSync accountsc
   - [Disabled] test_rocketbar_add_collection_save_bookmark -
   https://bugzil.la/1162112 - TimeoutException: TimeoutException: Timed
   out after 30.1 seconds
   - [Disabled] test_fmradio_find_stations.py - https://bugzil.la/1000863
   Investigate test_fmradio_find_stations.py failure
   - [Disabled] test_ftu_skip_tour_desktopb2g.py - Desktop Only
   - [Disabled] test_lockscreen_time_check.py - https://bugzil.la/1141258
   disabled until bug fixed
   - [Disabled] test_settings_bluetooth.py - Bug 1134244 -
   test_settings_bluetooth.py:test_toggle_bluetooth_settings is failing on
   bluetooth_settings.enable_visible_to_all()
   - [Disabled] test_settings_airplane_mode.py - https://bugzil.la/1131070
   - [Disabled] test_settings_change_time_format.py -
   https://bugzil.la/1144686


*Non-smoketests:*

http://jenkins1.qa.scl3.mozilla.com/view/UI/job/flame-kk-319.mozilla-central.nightly.ui.functional.non-smoke.1.bitbar/73/
http://jenkins1.qa.scl3.mozilla.com/view/UI/job/flame-kk-319.mozilla-central.nightly.ui.functional.non-smoke.2.bitbar/73/

*Test Failures *- All tests failed due to timeout issue (
https://bugzil.la/1170175). On ad-hoc re-run these issues were not
reproduced.

*Expected failures / disabled tests:*

   - [Expected fail] test_call_log_groups.TestCallLogGroups -
   https://bugzil.la/1117804 - [v2.2] Investigate test_call_log_groups
   failure
   - [Expected fail] test_change_language_settings_rtl -
   https://bugzil.la/1137766 - Error in both test_settings_change_language
   tests: exception "Element '%s' could not be foundin select wrapper"
   - [Expected fail] test_import_gmail_no_network.py -
   https://bugzil.la/1155763 -xfail
   - [Expected fail] test_change_language_settings_rtl -
   https://bugzil.la/1137766 - Error in both test_settings_change_language
   tests: exception "Element '%s' could not be foundin select wrapper"
   - [Disabled] test_call_log_all_calls.py - https://bugzil.la/1096385 -
   Investigate failure in test_call_log_all_calls.py, call log is displayed
   erroneously
   - [Disabled] test_dialer_set_up_conference_call.py -
   https://bugzil.la/1117813 - Make PlivoUtil use a valid 'answer_url' with
   a valid Plivo XML
   - [Disabled] test_setup_and_send_active_sync_email.py - Bug 1028192 -
   Problems with ActiveSync accounts
   - [Disabled] test_receive_active_sync_email.py -
   https://bugzil.la/1028192 - Problems with ActiveSync accounts
   - [Disabled] test_rocketbar_add_collection_save_bookmark -
   https://bugzil.la/1162112 - TimeoutException: TimeoutException: Timed
   out after 30.1 seconds
   - [Disabled] test_fmradio_find_stations.py - https://bugzil.la/1000863 -
   Investigate test_fmradio_find_stations.py failure
   - [Disabled] test_ftu_skip_tour_desktopb2g.py - Test runs only on desktop
   - [Disabled] test_lockscreen_time_check.py - https://bugzil.la/1141258
   disabled until bug fixed
   - [Disabled] test_settings_bluetooth.py - https://bugzil.la/1134244 -
   test_settings_bluetooth.py:test_toggle_bluetooth_settings is failing on
   bluetooth_settings.enable_visible_to_all()
   - [Disabled] test_settings_airplane_mode.py - https://bugzil.la/1131070
   - [Disabled] test_settings_change_time_format.py -
   https://bugzil.la/1144686



*Build under test:*

Device firmware (base) L1TC100118D0
Device firmware (date) 01 Jun 2015 08:27:52
Device firmware (incremental) eng.cltbld.20150601.042741
Device firmware (release) 4.4.2
Device identifier flame
Device memory 219772 kB
Device serial 356cd044
Device uptime 0 days 0 hours 2 minutes 12 seconds
Gaia date 29 May 2015 17:20:26
Gaia revision e6dc0f4c5834
Gecko build 20150601010203
Gecko revision f8d21278244b
Gecko version 41.0a1


*Summary:*

*Smoketests:*

179 tests ran in 6781.9 seconds.
0 passed, 135 skipped, 0 failed, 43 errors.
1 expected failures, 0 unexpected passes.

*Non-smoketests:*

126 tests ran in 10404.4 seconds.
0 passed, 58 skipped, 0 failed, 66 errors.
2 expected failures, 0 unexpected passes.

123 tests ran in 10000.0 seconds.
0 passed, 58 skipped, 0 failed, 63 errors.
2 expected failures, 0 unexpected passes.
-------------- next part --------------
An HTML attachment was scrubbed...
URL: <http://mail.mozilla.org/pipermail/fxosqa-report-watchlist/attachments/20150602/18f351d3/attachment.html>


More information about the Fxosqa-report-watchlist mailing list