07/29/2015 Flame KK v18D-1 319 MB Gaia-ui Automation mozilla-central Mozilla RIL Full Flash Build 39/43 smoketests, 114/120 non-smoketests

Oliver Nelson onelson at qanalydocs.com
Wed Jul 29 17:53:49 UTC 2015


*Smoketests:*
http://jenkins1.qa.scl3.mozilla.com/view/UI/job/flame-kk-319.mozilla-central.nightly.ui.functional.smoke.bitbar/318/

*Test failures - 0 replicable manually:*

   - [Not reproduced manually] test_add_new_contact --
   https://bugzil.la/1188974 - TimeoutException: Timed out after 10.3
   seconds
   - [Not reproduced manually] test_IMAP_email_notification -- Reproduced
   via Jenkins adhoc; 4/5 passing
   - [Not reproduced manually] test_sms_contact -- Reproduced via Jenkins
   adhoc; 3/5 passing
   - [Not reproduced manually] test_marketplace_launch -- Not reproduced
   via Jenkins adhoc; 5/5 passing


*Non-smoketests:*

http://jenkins1.qa.scl3.mozilla.com/view/UI/job/flame-kk-319.mozilla-central.nightly.ui.functional.non-smoke.1.bitbar/197/
http://jenkins1.qa.scl3.mozilla.com/view/UI/job/flame-kk-319.mozilla-central.nightly.ui.functional.non-smoke.2.bitbar/197/

*Test failures - 1 replicable manually:*

   - [Not reproduced manually] test_rocketbar_offline_behavior --
   https://bugzil.la/1188080 - NoSuchWindowException: None
   - [Reproduces manually] test_spark_apps_present -- Spark Apps not
   flashed to flame device, Johan handling this
   - [Not reproduced manually] https://bugzil.la/1187819 -
   JavascriptException: TypeError: this.element is null at app://
   system.gaiamobile.org/js/app_window.js
      - test_settings_media_storage
      - test_cost_control_reset_wifi
   - [Not reproduced manually] https://bugzil.la/1188974 - NEW -
   TimeoutException: Timed out after 10.3 seconds
      - test_keyboard
      - test_default_contact_image


*Expected failures / disabled tests:*

   - [Expected fail] test_change_language_settings_rtl -
   https://bugzil.la/1137766 - Error in both test_settings_change_language
   tests: exception "Element '%s' could not be foundin select wrapper"
   - [Expected fail] test_change_language_settings -
   https://bugzil.la/1137766 - Error in both test_settings_change_language
   tests: exception "Element '%s' could not be foundin select wrapper"
   - [Expected fail] test_import_gmail_no_network.py -
   https://bugzil.la/1155763 -xfail
   - [Expected fail] test_call_log_groups.TestCallLogGroups -
   https://bugzil.la/1117804 - [v2.2] Investigate test_call_log_groups
   failure
   - [Disabled] test_settings_change_time_format -- Bug 1144868 - Disable
   test_settings_change_time_format consistently failing because of Bug 1144686
   - [Disabled] test_settings_airplane_mode -- https://bugzil.la/1131070
   - [Disabled] test_settings_bluetooth -- https://bugzil.la/1134244 -
   test_settings_bluetooth.py:test_toggle_bluetooth_settings is failing on
   bluetooth_settings.enable_visible_to_all()
   - [Disabled] test_lockscreen_time_check -- Bug 1167848 - Disable
   test_lockscreen_time_check.py until bug 1141258 is fixed
   - [Disabled] test_ftu_skip_tour_desktopb2g -- Bug 1147611 - Intermittent
   failures
   - [Disabled] test_fmradio_find_stations.py - https://bugzil.la/1000863 -
   Investigate test_fmradio_find_stations.py failure
   - [Disabled] test_receive_active_sync_email.py -
   https://bugzil.la/1028192 - Problems with ActiveSync accounts
   - [Disabled] test_setup_and_send_active_sync_email.py - Bug 1028192 -
   Problems with ActiveSync accounts
   - [Disabled] test_dialer_set_up_conference_call.py -
   https://bugzil.la/1117813 - Make PlivoUtil use a valid 'answer_url' with
   a valid Plivo XML
   - [Disabled] test_call_log_all_calls.py - https://bugzil.la/1096385 -
   Investigate failure in test_call_log_all_calls.py, call log is displayed
   erroneously


*Build under test:*

Device firmware (base)     L1TC000118D0
Device firmware (date)     29 Jul 2015 10:34:30
Device firmware (incremental)     eng.cltbld.20150729.063419
Device firmware (release)     4.4.2
Device identifier     flame
Device memory     219772 kB
Device serial     f0484102
Device uptime     0 days 0 hours 2 minutes 14 seconds
Gaia date     28 Jul 2015 19:29:56
Gaia revision     21256d7665f9
Gecko build     20150729030209
Gecko revision     2ee9895e032c
Gecko version     42.0a1

*Summary:*

*Smoketests:*

178 tests ran in 5470.5 seconds.
39 passed, 135 skipped, 0 failed, 4 errors.
0 expected failures, 0 unexpected passes.

*Non-smoketest:*

127 tests ran in 5631.7 seconds.
57 passed, 66 skipped, 0 failed, 2 errors.
2 expected failures, 0 unexpected passes.

129 tests ran in 5811.7 seconds.
57 passed, 66 skipped, 0 failed, 4 errors.
2 expected failures, 0 unexpected passes.
-------------- next part --------------
An HTML attachment was scrubbed...
URL: <http://mail.mozilla.org/pipermail/fxosqa-report-watchlist/attachments/20150729/1079dd3f/attachment-0001.html>


More information about the Fxosqa-report-watchlist mailing list