07/27/2015 Flame KK v18D-1 319 MB Gaia-ui Automation mozilla-central Mozilla RIL Full Flash Build 40/44 smoketests, 109/121 non-smoketests

Oliver Nelson onelson at qanalydocs.com
Mon Jul 27 20:12:01 UTC 2015


*Smoketests:*
http://jenkins1.qa.scl3.mozilla.com/view/UI/job/flame-kk-319.mozilla-central.nightly.ui.functional.smoke.bitbar/314/

*Test failures - 1 replicable manually:*

   - [Reproduces manually] test_setup_basic_gmail --
   https://bugzil.la/1187077 - NoSuchWindowException: None
   - [Not reproduced manually] test_dialer -- https://bugzil.la/1183710 -
   AssertionError: 'telephony' != u'none'
   - [Not reproduced manually] test_homescreen_move_app -- Not reproduced
   via Jenkins adhoc; 5/5 passing
   - [Not reproduced manually] test_marketplace_packaged_app -- Not
   reproduced via Jenkins adhoc; 5/5 passing


*Non-smoketests:*

http://jenkins1.qa.scl3.mozilla.com/view/UI/job/flame-kk-319.mozilla-central.nightly.ui.functional.non-smoke.1.bitbar/193/
http://jenkins1.qa.scl3.mozilla.com/view/UI/job/flame-kk-319.mozilla-central.nightly.ui.functional.non-smoke.2.bitbar/192/

*Test failures - 2 replicable manually:*

   - [Reproduces manually; timing based] test_gallery_switch_to_camera --
   https://bugzil.la/1187056 - TimeoutException: Timed out after 10.1
   seconds
   - [Reproduces manually; timing based] test_gallery_crop_photo --
   https://bugzil.la/1187056 - TimeoutException: Timed out after 10.1
   seconds
   - [Not reproduced manually]
   test_lockscreen_unlock_to_homescreen_with_passcode --
   https://bugzil.la/1181662 - Timed out after 10.1 seconds
   - [Not reproduced manually] test_sort_contacts -- *NEW* -
   https://bugzil.la/1187726 -  NoSuchElementException: Unable to locate
   element: input[name="order.lastname"]
   - [Not reproduced manually] test_settings_media_storage -- *NEW* -
   https://bugzil.la/1187819 - JavascriptException: TypeError: this.element
   is null at app://system.gaiamobile.org/js/app_window.js
   - [Not reproduced manually] test_sms_notification -- Reproduced via
   Jenkins adhoc; 4/5 passing
   - [Not reproduced manually] test_settings_change_keyboard_language --
   NEW - https://bugzil.la/1187066 - "Timed out after 10.3 seconds"
   - [Not reproduced manually] test_cost_control_reset_wifi -- *NEW* -
   https://bugzil.la/1187819 - JavascriptException: TypeError: this.element
   is null at app://system.gaiamobile.org/js/app_window.js
   - [Not reproduced manually] test_rocketbar_offline_behavior -- *NEW* -
   https://bugzil.la/1188080 - NoSuchWindowException: None
   - [Not reproduced manually] test_dialer_add_contact -- Not reproduced
   via Jenkins adhoc; 5/5 passing
   - [Not reproduced manually]
   test_dialer_miss_call_from_known_contact_notification -- Reproduced via
   Jenkins adhoc; 3/5 passing
   - [Not reproduced manually] test_dialer_receive_call_with_contact_photo
   -- Not reproduced via Jenkins adhoc; 5/5 passing


*Expected failures / disabled tests:*

   - [Expected fail] test_change_language_settings_rtl -
   https://bugzil.la/1137766 - Error in both test_settings_change_language
   tests: exception "Element '%s' could not be foundin select wrapper"
   - [Expected fail] test_change_language_settings -
   https://bugzil.la/1137766 - Error in both test_settings_change_language
   tests: exception "Element '%s' could not be foundin select wrapper"
   - [Expected fail] test_import_gmail_no_network.py -
   https://bugzil.la/1155763 -xfail
   - [Expected fail] test_call_log_groups.TestCallLogGroups -
   https://bugzil.la/1117804 - [v2.2] Investigate test_call_log_groups
   failure
   - [Disabled] test_settings_change_time_format -- Bug 1144868 - Disable
   test_settings_change_time_format consistently failing because of Bug 1144686
   - [Disabled] test_settings_airplane_mode -- https://bugzil.la/1131070
   - [Disabled] test_settings_bluetooth -- https://bugzil.la/1134244 -
   test_settings_bluetooth.py:test_toggle_bluetooth_settings is failing on
   bluetooth_settings.enable_visible_to_all()
   - [Disabled] test_lockscreen_time_check -- Bug 1167848 - Disable
   test_lockscreen_time_check.py until bug 1141258 is fixed
   - [Disabled] test_ftu_skip_tour_desktopb2g -- Bug 1147611 - Intermittent
   failures
   - [Disabled] test_fmradio_find_stations.py - https://bugzil.la/1000863 -
   Investigate test_fmradio_find_stations.py failure
   - [Disabled] test_receive_active_sync_email.py -
   https://bugzil.la/1028192 - Problems with ActiveSync accounts
   - [Disabled] test_setup_and_send_active_sync_email.py - Bug 1028192 -
   Problems with ActiveSync accounts
   - [Disabled] test_dialer_set_up_conference_call.py -
   https://bugzil.la/1117813 - Make PlivoUtil use a valid 'answer_url' with
   a valid Plivo XML
   - [Disabled] test_call_log_all_calls.py - https://bugzil.la/1096385 -
   Investigate failure in test_call_log_all_calls.py, call log is displayed
   erroneously


*Build under test:*

Device firmware (base)     L1TC000118D0
Device firmware (date)     27 Jul 2015 10:39:20
Device firmware (incremental)     eng.cltbld.20150727.063909
Device firmware (release)     4.4.2
Device identifier     flame
Device memory     219772 kB
Device serial     1d9a563d
Device uptime     0 days 0 hours 2 minutes 11 seconds
Gaia date     24 Jul 2015 11:53:36
Gaia revision     ade1ef5249cf
Gecko build     20150727030212
Gecko revision     d3228c82badd
Gecko version     42.0a1

*Summary:*

*Smoketests:*

177 tests ran in 4998.0 seconds.
40 passed, 133 skipped, 1 failed, 3 errors.
0 expected failures, 0 unexpected passes.

*Non-smoketest:*

128 tests ran in 5884.4 seconds.
56 passed, 64 skipped, 1 failed, 5 errors.
2 expected failures, 0 unexpected passes.

125 tests ran in 5734.5 seconds.
53 passed, 64 skipped, 0 failed, 6 errors.
2 expected failures, 0 unexpected passes.
-------------- next part --------------
An HTML attachment was scrubbed...
URL: <http://mail.mozilla.org/pipermail/fxosqa-report-watchlist/attachments/20150727/41456277/attachment.html>


More information about the Fxosqa-report-watchlist mailing list