07/24/2015 Flame KK v18D-1 319 MB Gaia-ui Automation mozilla-central Mozilla RIL Full Flash Build 34/44 smoketests, 94/121 non-smoketests

Oliver Nelson onelson at qanalydocs.com
Fri Jul 24 20:18:20 UTC 2015


* nonsmoke-2.bitbar failed after 2 triggers, results from MV lab device was
used today
Two big blocking bugs affecting all of smoke and non-smoke tests today:


*[Not reproduced manually] https://bugzil.la/1187015
<https://bugzil.la/1187015> - TimeoutException: Timed out after 10.1
seconds*** there is a fix for this issue that will resolve this by Monday

*Smoke:** test_browser_cell_data
* test_browser_lan
* test_cost_control_data_alert_mobile
* test_browser_play_video


*Non-Smoke:** test_browser_save_image
* test_browser_share_link
* test_rocketbar_search

* test_browser_navigation
* test_browser_clear_browsing_history
* test_cost_control_reset_wifi
* test_rocketbar_offline_behavior



*[Reproduces manually] https://bugzil.la/1186920
<https://bugzil.la/1186920> - [Contacts] Unable to open contacts
application *
*Smoke: ** test_add_new_contact
* test_edit_contact
* test_sms_contact
* test_add_photo_to_contact


*Non-Smoke:** test_delete_all_contacts
* test_sort_contacts
* test_add_contact_to_favorites
* test_export_contacts_to_sdcard
* test_import_contacts_menu_no_network
* test_add_to_an_existing_contact_from_messages
* test_sms_add_contact
* test_import_contacts_from_gmail -- Blocked: https://bugzil.la/1182199 -
TimeoutException: Timed out after 10.1 seconds

* test_call_contact
* test_default_contact_image
* test_delete_contact
* test_import_contacts_from_sim
* test_import_contacts_from_sdcard
* test_import_edit_export_contact
* test_dialer_add_contact
* test_keyboard
* test_add_to_new_contact_from_messages



*Smoketests:*
http://jenkins1.qa.scl3.mozilla.com/view/UI/job/flame-kk-319.mozilla-central.nightly.ui.functional.smoke.bitbar/308/

*Test failures - 1 replicable manually:*

   - [Reproduces manually] test_setup_basic_gmail -- NEW -
   https://bugzil.la/1187077 - NoSuchWindowException: None
   - [Not reproduced manually] test_dialer -- https://bugzil.la/1183710 -
   AssertionError: 'telephony' != u'none'


*Non-smoketests:*

http://jenkins1.qa.scl3.mozilla.com/view/UI/job/flame-kk-319.mozilla-central.nightly.ui.functional.non-smoke.1.bitbar/187/
http://jenkins1.qa.scl3.mozilla.com/job/flame-kk-319.mozilla-central.nightly.ui.functional.non-smoke.2/366/
** evaluated non-smoke report due to bitbar failing after retrigger

*Test failures - 0 replicable manually:*

   - [Not reproduced manually]
   test_lockscreen_unlock_to_homescreen_with_passcode --
   https://bugzil.la/1181662 - Timed out after 10.1 seconds
   - [Not reproduced manually] test_settings_change_keyboard_language --
   https://bugzil.la/1187066 - "Timed out after 10.3 seconds"
   - [Not reproduced manually] test_sms_contact_input_validation -- Not
   reproduced via Jenkins adhoc; 5/5 passing


*Expected failures / disabled tests:*

   - [Expected fail] test_change_language_settings_rtl -
   https://bugzil.la/1137766 - Error in both test_settings_change_language
   tests: exception "Element '%s' could not be foundin select wrapper"
   - [Expected fail] test_change_language_settings -
   https://bugzil.la/1137766 - Error in both test_settings_change_language
   tests: exception "Element '%s' could not be foundin select wrapper"
   - [Expected fail] test_import_gmail_no_network.py -
   https://bugzil.la/1155763 -xfail
   - [Expected fail] test_call_log_groups.TestCallLogGroups -
   https://bugzil.la/1117804 - [v2.2] Investigate test_call_log_groups
   failure
   - [Disabled] test_settings_change_time_format -- Bug 1144868 - Disable
   test_settings_change_time_format consistently failing because of Bug 1144686
   - [Disabled] test_settings_airplane_mode -- https://bugzil.la/1131070
   - [Disabled] test_settings_bluetooth -- https://bugzil.la/1134244 -
   test_settings_bluetooth.py:test_toggle_bluetooth_settings is failing on
   bluetooth_settings.enable_visible_to_all()
   - [Disabled] test_lockscreen_time_check -- Bug 1167848 - Disable
   test_lockscreen_time_check.py until bug 1141258 is fixed
   - [Disabled] test_ftu_skip_tour_desktopb2g -- Bug 1147611 - Intermittent
   failures
   - [Disabled] test_fmradio_find_stations.py - https://bugzil.la/1000863 -
   Investigate test_fmradio_find_stations.py failure
   - [Disabled] test_receive_active_sync_email.py -
   https://bugzil.la/1028192 - Problems with ActiveSync accounts
   - [Disabled] test_setup_and_send_active_sync_email.py - Bug 1028192 -
   Problems with ActiveSync accounts
   - [Disabled] test_dialer_set_up_conference_call.py -
   https://bugzil.la/1117813 - Make PlivoUtil use a valid 'answer_url' with
   a valid Plivo XML
   - [Disabled] test_call_log_all_calls.py - https://bugzil.la/1096385 -
   Investigate failure in test_call_log_all_calls.py, call log is displayed
   erroneously


*Build under test:*

Device firmware (base)     L1TC000118D0
Device firmware (date)     24 Jul 2015 08:44:10
Device firmware (incremental)     eng.cltbld.20150724.044358
Device firmware (release)     4.4.2
Device identifier     flame
Device memory     219772 kB
Device serial     94fdce95
Device uptime     0 days 0 hours 2 minutes 21 seconds
Gaia date     23 Jul 2015 17:16:25
Gaia revision     ec2199b32430
Gecko build     20150724010206
Gecko revision     cb8bdb8ffaef
Gecko version     42.0a1

*Summary:*

*Smoketests:*

177 tests ran in 6462.4 seconds.
34 passed, 133 skipped, 1 failed, 9 errors.
0 expected failures, 0 unexpected passes.

*Non-smoketest:*

128 tests ran in 8266.5 seconds.
50 passed, 64 skipped, 0 failed, 12 errors.
2 expected failures, 0 unexpected passes.

125 tests ran in 8026.5 seconds.
44 passed, 64 skipped, 0 failed, 15 errors.
2 expected failures, 0 unexpected passes.
-------------- next part --------------
An HTML attachment was scrubbed...
URL: <http://mail.mozilla.org/pipermail/fxosqa-report-watchlist/attachments/20150724/6d3a8098/attachment-0001.html>


More information about the Fxosqa-report-watchlist mailing list