07/14/2015 Flame KK v18D-1 319 MB Gaia-ui Automation mozilla-central Mozilla RIL Full Flash Build 38/44 smoketests, 108/121 non-smoketests

Oliver Nelson onelson at qanalydocs.com
Tue Jul 14 19:47:16 UTC 2015


*Smoketests:*
http://jenkins1.qa.scl3.mozilla.com/view/UI/job/flame-kk-319.mozilla-central.nightly.ui.functional.smoke.bitbar/285/

*Test failures - 0 replicable manually:*

   - [Not reproduced manually] NEW - https://bugzil.la/1183696 -
   TimeoutException: Timed out after 10.3 seconds
      - test_browser_cell_data
      - test_browser_lan
      - test_browser_play_video
      - test_cost_control_data_alert_mobile


   - [Not reproduced manually] test_clock_create_new_alarm - NEW -
   https://bugzil.la/1183800 -
   - [Not reproduced manually] test_dialer - NEW - https://bugzil.la/1183710
   - AssertionError: 'telephony' != u'none'


*Non-smoketests:*

http://jenkins1.qa.scl3.mozilla.com/view/UI/job/flame-kk-319.mozilla-central.nightly.ui.functional.non-smoke.1.bitbar/163/
http://jenkins1.qa.scl3.mozilla.com/view/UI/job/flame-kk-319.mozilla-central.nightly.ui.functional.non-smoke.2.bitbar/161/


*Test failures - 3 replicable manually:*

   - [Not reproduced manually] NEW - https://bugzil.la/1183696 -
   TimeoutException: Timed out after 10.3 seconds
      - test_browser_save_image
      - test_browser_share_link
      - test_browser_navigation
      - test_browser_clear_browsing_history
      - test_cost_control_reset_wifi


   - [Reproduces manually] Functional Regression:
   https://bugzilla.mozilla.org/show_bug.cgi?id=1183301 --  [aries][Flame]
   import of Gmail/Outlook contacts is broken and hoses the app
      - test_import_contacts_from_gmail
      - test_import_contacts_from_sim
      - test_import_edit_export_contact


   - [Not reproduced manually]
   test_lockscreen_unlock_to_homescreen_with_passcode --
   https://bugzil.la/1181662 - Timed out after 10.1 seconds
   - [Not reproduced manually] test_import_contacts_from_sdcard -- Not
   reproduced via Jenkins adhoc; 5/5 passing
   - [Not reproduced manually] test_dialer_add_contact --
   https://bugzil.la/1183208 - TimeoutException: Timed out after 10.3
   seconds
   - [Not reproduced manually] test_rocketbar_offline_behavior --
   https://bugzil.la/1178859 - IOError: Connection to Marionette server is
   lost.
   - [Not reproduced manually] test_add_to_new_contact_from_messages  -
   https://bugzil.la/1183202 - TimeoutException: Timed out after 10.1
   seconds


*Expected failures / disabled tests:*

   - [Expected fail] test_change_language_settings_rtl -
   https://bugzil.la/1137766 - Error in both test_settings_change_language
   tests: exception "Element '%s' could not be foundin select wrapper"
   - [Expected fail] test_change_language_settings -
   https://bugzil.la/1137766 - Error in both test_settings_change_language
   tests: exception "Element '%s' could not be foundin select wrapper"
   - [Expected fail] test_import_gmail_no_network.py -
   https://bugzil.la/1155763 -xfail
   - [Expected fail] test_call_log_groups.TestCallLogGroups -
   https://bugzil.la/1117804 - [v2.2] Investigate test_call_log_groups
   failure
   - [Disabled] test_settings_change_time_format -- Bug 1144868 - Disable
   test_settings_change_time_format consistently failing because of Bug 1144686
   - [Disabled] test_settings_airplane_mode -- https://bugzil.la/1131070
   - [Disabled] test_settings_bluetooth -- https://bugzil.la/1134244 -
   test_settings_bluetooth.py:test_toggle_bluetooth_settings is failing on
   bluetooth_settings.enable_visible_to_all()
   - [Disabled] test_lockscreen_time_check -- Bug 1167848 - Disable
   test_lockscreen_time_check.py until bug 1141258 is fixed
   - [Disabled] test_ftu_skip_tour_desktopb2g -- Bug 1147611 - Intermittent
   failures
   - [Disabled] test_fmradio_find_stations.py - https://bugzil.la/1000863 -
   Investigate test_fmradio_find_stations.py failure
   - [Disabled] test_receive_active_sync_email.py -
   https://bugzil.la/1028192 - Problems with ActiveSync accounts
   - [Disabled] test_setup_and_send_active_sync_email.py - Bug 1028192 -
   Problems with ActiveSync accounts
   - [Disabled] test_dialer_set_up_conference_call.py -
   https://bugzil.la/1117813 - Make PlivoUtil use a valid 'answer_url' with
   a valid Plivo XML
   - [Disabled] test_call_log_all_calls.py - https://bugzil.la/1096385 -
   Investigate failure in test_call_log_all_calls.py, call log is displayed
   erroneously


*Build under test:*

Device firmware (base)     L1TC100118D0
Device firmware (date)     14 Jul 2015 08:44:12
Device firmware (incremental)     eng.cltbld.20150714.044401
Device firmware (release)     4.4.2
Device identifier     flame
Device memory     219772 kB
Device serial     1b41c231
Device uptime     0 days 0 hours 2 minutes 11 seconds
Gaia date     13 Jul 2015 23:56:32
Gaia revision     7676b68b4d32
Gecko build     20150714010206
Gecko revision     0931671a14ef
Gecko version     42.0a1

*Summary:*

*Smoketests:*

177 tests ran in 5413.4 seconds.
38 passed, 133 skipped, 1 failed, 5 errors.
0 expected failures, 0 unexpected passes.

*Non-smoketest:*

128 tests ran in 5625.3 seconds.
58 passed, 64 skipped, 0 failed, 4 errors.
2 expected failures, 0 unexpected passes.

125 tests ran in 5537.4 seconds.
50 passed, 64 skipped, 0 failed, 9 errors.
2 expected failures, 0 unexpected passes.
-------------- next part --------------
An HTML attachment was scrubbed...
URL: <http://mail.mozilla.org/pipermail/fxosqa-report-watchlist/attachments/20150714/17e3445c/attachment.html>


More information about the Fxosqa-report-watchlist mailing list