07/07/2015 Flame KK v18D-1 319 MB Gaia-ui Automation mozilla-central Mozilla RIL Full Flash Build 41/44 smoketests, 114/123 non-smoketests

Oliver Nelson onelson at qanalydocs.com
Tue Jul 7 19:22:06 UTC 2015


*Smoketests:*
http://jenkins1.qa.scl3.mozilla.com/view/UI/job/flame-kk-319.mozilla-central.nightly.ui.functional.smoke.bitbar/270/

*Test failures - 0 replicable manually:*

   - [Not reproduced manually] test_IMAP_email_notification --
   https://bugzil.la/1181273 - "TimeoutException: Timed out after 60.0
   seconds" or 10 seconds
   - [Not reproduced manually] test_rocketbar_add_collection_save_bookmark
   -- https://bugzil.la/1181266 - "TimeoutException: Timed out after" 30 or
   10 seconds
   - [Not reproduced manually] test_ftu_status_bar -- Not reproduced via
   Jenkins adhoc; 5/5 passing


*Non-smoketests:*

http://jenkins1.qa.scl3.mozilla.com/view/UI/job/flame-kk-319.mozilla-central.nightly.ui.functional.non-smoke.1.bitbar/147/
http://jenkins1.qa.scl3.mozilla.com/view/UI/job/flame-kk-319.mozilla-central.nightly.ui.functional.non-smoke.2.bitbar/145/


*Test failures - 2 replicable manually:*

   - [Reproduces manually] test_email_one_header_displayed --
   https://bugzil.la/1176584 - NoSuchElementException: Unable to locate
   element: #cards-view li[data-origin*="email"]
   - [Reproduces manually] test_browser_bookmark --
   https://bugzil.la/1178859 - IOError: Connection to Marionette server is
   lost.
   - [Not reproduced manually] test_rocketbar_offline_behavior --
   https://bugzil.la/1178859 - IOError: Connection to Marionette server is
   lost.
      - appears identical
   - [Not reproduced manually] test_sms_notification -- Reproduced via
   Jenkins adhoc; 4/5 passing: AssertionError: False is not true
   - [Not reproduced manually]
   test_sms_notification_removed_when_sms_deleted --
   https://bugzil.la/1172460 - TimeoutException: Timed out after 300.1
   seconds with message: Notification did not appear
   - [Not reproduced manually]
   test_dialer_miss_call_from_known_contact_notification --
   https://bugzil.la/1174282 - NoSuchElementException: Unable to locate
   element: .handled-call.incoming
   - [Not reproduced manually] test_dialer_receive_call_with_contact_photo
   -- https://bugzil.la/1174282 - NoSuchElementException: Unable to locate
   element: .handled-call.incoming
   - [Not reproduced manually] test_cost_control_ftu -- Not reproduced via
   Jenkins adhoc; 5/5 passing
   - [Not reproduced manually] test_add_to_new_contact_from_messages -- Not
   reproduced via Jenkins adhoc; 5/5 passing


*Expected failures / disabled tests:*

   - [Expected fail] test_change_language_settings_rtl -
   https://bugzil.la/1137766 - Error in both test_settings_change_language
   tests: exception "Element '%s' could not be foundin select wrapper"
   - [Expected fail] test_change_language_settings -
   https://bugzil.la/1137766 - Error in both test_settings_change_language
   tests: exception "Element '%s' could not be foundin select wrapper"
   - [Expected fail] test_import_gmail_no_network.py -
   https://bugzil.la/1155763 -xfail
   - [Expected fail] test_call_log_groups.TestCallLogGroups -
   https://bugzil.la/1117804 - [v2.2] Investigate test_call_log_groups
   failure
   - [Disabled] test_settings_change_time_format -- Bug 1144868 - Disable
   test_settings_change_time_format consistently failing because of Bug 1144686
   - [Disabled] test_settings_airplane_mode -- https://bugzil.la/1131070
   - [Disabled] test_settings_bluetooth -- https://bugzil.la/1134244 -
   test_settings_bluetooth.py:test_toggle_bluetooth_settings is failing on
   bluetooth_settings.enable_visible_to_all()
   - [Disabled] test_lockscreen_time_check -- Bug 1167848 - Disable
   test_lockscreen_time_check.py until bug 1141258 is fixed
   - [Disabled] test_homescreen_column_layout -- skip-if: device == "flame"
   - [Disabled] test_ftu_skip_tour_desktopb2g -- Bug 1147611 - Intermittent
   failures
   - [Disabled] test_fmradio_find_stations.py - https://bugzil.la/1000863 -
   Investigate test_fmradio_find_stations.py failure
   - [Disabled] test_receive_active_sync_email.py -
   https://bugzil.la/1028192 - Problems with ActiveSync accounts
   - [Disabled] test_setup_and_send_active_sync_email.py - Bug 1028192 -
   Problems with ActiveSync accounts
   - [Disabled] test_dialer_set_up_conference_call.py -
   https://bugzil.la/1117813 - Make PlivoUtil use a valid 'answer_url' with
   a valid Plivo XML
   - [Disabled] test_call_log_all_calls.py - https://bugzil.la/1096385 -
   Investigate failure in test_call_log_all_calls.py, call log is displayed
   erroneously


*Build under test:*

Device firmware (base)     L1TC100118D0
Device firmware (date)     07 Jul 2015 08:24:17
Device firmware (incremental)     eng.cltbld.20150707.042406
Device firmware (release)     4.4.2
Device identifier     flame
Device memory     219772 kB
Device serial     f0314099
Device uptime     0 days 0 hours 2 minutes 32 seconds
Gaia date     06 Jul 2015 18:14:41
Gaia revision     e6506d68e014
Gecko build     20150707010204
Gecko revision     e7e69cc8c07b
Gecko version     42.0a1

*Summary:*

*Smoketests:*

178 tests ran in 4944.4 seconds.
41 passed, 134 skipped, 0 failed, 3 errors.
0 expected failures, 0 unexpected passes.

*Non-smoketest:*

128 tests ran in 6310.2 seconds.
59 passed, 63 skipped, 1 failed, 3 errors.
2 expected failures, 0 unexpected passes.

125 tests ran in 6236.9 seconds.
55 passed, 63 skipped, 0 failed, 5 errors.
2 expected failures, 0 unexpected passes.
-------------- next part --------------
An HTML attachment was scrubbed...
URL: <http://mail.mozilla.org/pipermail/fxosqa-report-watchlist/attachments/20150707/7637d6f2/attachment.html>


More information about the Fxosqa-report-watchlist mailing list